{"text_format":"1","workbook":"xlsx","n_sheets":10,"sheets":["HOME","ANEXO 1 -->","Instrucciones de Uso A1","Comparativo","Base de datos","ANEXO 2 -->","Instrucciones de Uso A2","Infraestructura","Areas","Estacionamiento de la flota"],"not_rendered":{"charts":0,"images":19,"macros":1,"external_links":1,"defined_names":17,"comments":2,"pivot_tables":0},"unopened":[],"bounds":{"document_bytes":16777216,"sheet_cells":100000,"rows_first":2000,"rows_last":500,"rows_between":2000,"halvings":0,"cell_chars":16384,"cell_head_chars":4096},"cells_cut":0,"cells_raw":0,"read":"whole","date_system":"1900"}

{"sheet":"HOME","index":0,"n_rows":3,"n_cols":2,"rows_kept":3,"cut":false,"hidden":false,"merged":[]}
[null,"Documento de anexos al informe de consultoría realizada en 2020 - 2021 en el marco de la asistencia técnica dada por el Banco Interamericano de Desarrollo (BID) cooperación nacional en Colombia CO-T1558, financiada con recursos del Fondo UK-SIP de la Embajada Británica para el transporte urbano sostenible en ciudades colombianas:"]
[]
[null,"CRITERIOS TÉCNICOS PARA APOYAR LA COMPRA DE VEHÍCULOS DE CERO Y BAJAS EMISIONES DE 50 O MENOS PASAJEROS PARA COLOMBIA"]

{"sheet":"ANEXO 1 -->","index":1,"n_rows":9,"n_cols":2,"rows_kept":9,"cut":false,"hidden":false,"merged":[]}
[]
[null,"Anexo 1 - Inventario de Flota"]
[]
[null,"Se repertorian los 48 vehículos disponibles en 2021 que cumplen con los siguientes criterios, 20 de los cuales cuentan con disponibilidad de venta en Colombia:"]
[]
[null,"a) Cumplir con el nivel de emisiones Euro V o superior incluyendo cero emisiones."]
[null,"b) Capacidad de pasajeros 50 o inferior."]
[null,"c) Longitud máxima de chasis 9.000 mm."]
[null,"d) Accesibilidad universal."]

{"sheet":"Instrucciones de Uso A1","index":2,"n_rows":46,"n_cols":1,"rows_kept":46,"cut":false,"hidden":false,"merged":[[2,0,2,7],[0,0,0,7],[4,0,7,0],[45,0,56,0],[38,0,43,0],[29,0,35,0],[19,0,27,0],[12,0,17,0]]}
["INSTRUCTIVO PARA EL USO DE LA MATRIZ COMPARATIVA DE MARCAS"]
[]
["A continuación, se realiza una breve descripción para el uso de la matriz que integra el estudio, la cual cuenta un con un buscador que permite efectuar la comparación de tres (3) líneas de chasis en simultaneo, frente a los diferentes aspectos analizar de acuerdo a las unidades funcionales o sistemas del autobús."]
[]
["1.      Para ello debe posicionarse en el documento de cálculo en la pestaña “Comparativo”:"]
[]
[]
[]
[]
[]
[]
[]
["2.      Posteriormente ubicarse en las columnas D, E y F, en la fila 4, en donde se encontrará una lista desplegable, allí se pueden apreciar todas las líneas de chasises disponibles para el estudio, seleccionar la de su preferencia:"]
[]
[]
{"$rows_left_out":32}
{"sheet":"Comparativo","index":3,"n_rows":44,"n_cols":11,"rows_kept":44,"cut":false,"hidden":false,"merged":[[0,4,3,5]]}
[null,null,null,"GRAN GRUPO","CUADRO COMPARATIVO DE MARCAS ",null,null,null,null,null,"TIPOLOGÍA"]
[null,null,null,"ESPECIFICACIONES TÉCNICAS SISTEMA ELÉCTRICO",null,null,null,null,null,null,"ESPECIFICACIONES TÉCNICAS"]
[null,null,null,"ESPECIFICACIONES TÉCNICAS LLANTAS Y TRACCIÓN",null,null,null,null,null,null,"ESPECIFICACIONES TÉCNICAS TRANSMISIÓN"]
[null,null,null,"ESPECIFICACIONES TÉCNICAS",null,null,null,null,null,null,"ESPECIFICACIONES TÉCNICAS SISTEMA ELÉCTRICO"]
[null,null,null,null,null,null,null,null,null,null,"ESPECIFICACIONES TÉCNICAS SISTEMA SUSPENSIÓN"]
[null,"GRAN GRUPO","CARACTERÍSTICAS","CHEVROLET NQR ","SCANIA F280 4x2","MERCEDES BENZ OF 917",null,null,null,null,"ESPECIFICACIONES TÉCNICAS SISTEMA FRENOS"]
[null,"TIPOLOGÍA","TIPOLOGÍA",{"$f":"HLOOKUP(D$6,'Base de datos'!$B$1:$AX36,2,FALSE)","v":"BUS7"},{"$f":"HLOOKUP(E$6,'Base de datos'!$B$1:$AX36,2,FALSE)","v":"BUS3"},{"$f":"HLOOKUP(F$6,'Base de datos'!$B$1:$AX36,2,FALSE)","v":"BUS4"},null,null,null,null,"ESPECIFICACIONES TÉCNICAS LLANTAS Y TRACCIÓN"]
[null,"ESPECIFICACIONES TÉCNICAS","MOTOR",{"$f":"HLOOKUP(D$6,'Base de datos'!$B$1:$AX37,3,FALSE)","v":"ISUZU"},{"$f":"HLOOKUP(E$6,'Base de datos'!$B$1:$AX37,3,FALSE)","v":"SCANIA  "},{"$f":"HLOOKUP(F$6,'Base de datos'!$B$1:$AX37,3,FALSE)","v":"MERCEDES BENZ "},null,null,null,null,"ESPECIFICACIONES DE PESO"]
[null,"ESPECIFICACIONES TÉCNICAS","MODELO",{"$f":"HLOOKUP(D$6,'Base de datos'!$B$1:$AX38,4,FALSE)","v":" 4HK1-TCN"},{"$f":"HLOOKUP(E$6,'Base de datos'!$B$1:$AX38,4,FALSE)","v":"SCANIA 280"},{"$f":"HLOOKUP(F$6,'Base de datos'!$B$1:$AX38,4,FALSE)","v":"DC 4D34I"},null,null,null,null,"DIMENSIONES"]
[null,"ESPECIFICACIONES TÉCNICAS","COMBUSTIBLE",{"$f":"HLOOKUP(D$6,'Base de datos'!$B$1:$AX39,5,FALSE)","v":"DIÉSEL"},{"$f":"HLOOKUP(E$6,'Base de datos'!$B$1:$AX39,5,FALSE)","v":"GAS"},{"$f":"HLOOKUP(F$6,'Base de datos'!$B$1:$AX39,5,FALSE)","v":"DIÉSEL"},null,null,null,null,"ACCESIBILIDAD PERSONAS CON MOVILIDAD REDUCIDA"]
[null,"ESPECIFICACIONES TÉCNICAS","CILINDROS",{"$f":"HLOOKUP(D$6,'Base de datos'!$B$1:$AX40,6,FALSE)","v":4},{"$f":"HLOOKUP(E$6,'Base de datos'!$B$1:$AX40,6,FALSE)","v":5},{"$f":"HLOOKUP(F$6,'Base de datos'!$B$1:$AX40,6,FALSE)","v":4},null,null,null,null,"COSTO DE ADQUISICIÓN"]
[null,"ESPECIFICACIONES TÉCNICAS","CILINDRADA",{"$f":"HLOOKUP(D$6,'Base de datos'!$B$1:$AX41,7,FALSE)","v":"5.2"},{"$f":"HLOOKUP(E$6,'Base de datos'!$B$1:$AX41,7,FALSE)","v":"9.3"},{"$f":"HLOOKUP(F$6,'Base de datos'!$B$1:$AX41,7,FALSE)","v":"3.9"}]
[null,"ESPECIFICACIONES TÉCNICAS","POTENCIA CV",{"$f":"HLOOKUP(D$6,'Base de datos'!$B$1:$AX42,8,FALSE)","v":"155 CV"},{"$f":"HLOOKUP(E$6,'Base de datos'!$B$1:$AX42,8,FALSE)","v":"280 CV"},{"$f":"HLOOKUP(F$6,'Base de datos'!$B$1:$AX42,8,FALSE)","v":"172 CV"}]
[null,"ESPECIFICACIONES TÉCNICAS","TORQUE MAX",{"$f":"HLOOKUP(D$6,'Base de datos'!$B$1:$AX43,9,FALSE)","v":"419 Nm a 1600 rpm"},{"$f":"HLOOKUP(E$6,'Base de datos'!$B$1:$AX43,9,FALSE)","v":"1.350 Nm entre 1,000 -1,400 rpm"},{"$f":"HLOOKUP(F$6,'Base de datos'!$B$1:$AX43,9,FALSE)","v":"520 N.m (53 KGF-M) A 1.500 rpm"}]
[null,"ESPECIFICACIONES TÉCNICAS","NORMA DE EMISIONES",{"$f":"HLOOKUP(D$6,'Base de datos'!$B$1:$AX44,10,FALSE)","v":"EURO V (EGR / CATALIZADOR  DOC)"},{"$f":"HLOOKUP(E$6,'Base de datos'!$B$1:$AX44,10,FALSE)","v":"EURO VI"},{"$f":"HLOOKUP(F$6,'Base de datos'!$B$1:$AX44,10,FALSE)","v":"EURO V SCR"}]
{"$rows_left_out":30}
{"sheet":"Base de datos","index":4,"n_rows":45,"n_cols":51,"rows_kept":45,"cut":false,"hidden":false,"merged":[]}
["ESPECIFICACIÓN ","AGRALE MA 11.0 GAS","MODASA APOLO HG","VOLKSWAGEN 11.180 OD","SCANIA F280 4x2","MERCEDES BENZ OF 917","MERCEDES BENZ LO 916","HINO FC9J ","CHEVROLET NQR ","CHEVROLET NPR ","VOLKSWAGEN 9.160 OD","VOLKSWAGEN 8.160 OD","SUNWIN SWB6890M64","SUNWIN SWB6850Q","AGRALE MA 9.6","AGRALE MA 8.7","DAEWOO A85","KING LONG XMQ 6858","SUNLONG"," HFF6700BEV","PK6800BEV","BlueBus ","BredaMenarinibus Zeus","K7","eBuzz K6 Goldstone","Q6620CLBEV6 ","Evopro Modulo C68e","City Bus","Karsan Jets ","XMQ6802G","XMQ6706GEV ","XMQ6706EV","XMQ6662GEV","Orion Lite ","Orion E ","Autonom Shuttles ","Solo EV","Full Electric","Urbino 8.9 LE electric","ENB 8 ","EBN 9.5"," Vero 9 ","Starbus Ultra Electric 6/12 EV ","TMB bus electric ","Ford","A308 citybus","LLE-99Electric ","ZK6729D","B93S01",null,"AGRALE MA 11.0 GAS"]
["TIPOLOGÍA","BUSETA","BUS","BUS2","BUS3","BUS4","BUS5","BUS6","BUS7","BUSETA8","BUS9","BUSETA10","BUS11","BUS12","BUS13","BUS14","BUS15","BUS16","BUS17","BUSETON","BUSETON18","BUSETON19","BUSETON20","PADRON","BUSETON21","BUSETON22","BUSETON23","BUSETON24","BUSETON25","BUS26","BUSETON27","BUSETON28","BUSETON29","BUSETON30","BUSETON31","BUSETON32","BUSETON33","BUSETON34","BUSETON35","BUSETON36","BUSETON37","BUSETON ","BUSETON38","BUSETON39","BUSETON40","BUSETON41","BUSETON42","BUSETON43","BUSETON44",null,"MODASA APOLO HG"]
["MOTOR","FPT (FIAT)","FPT (FIAT)","MAN","SCANIA  ","MERCEDES BENZ ","MERCEDES BENZ ","HINO  ","ISUZU","ISUZU","CUMMINS","CUMMINS","CUMMINS","CUMMINS","CUMMINS","CUMMINS","CUMMINS","CUMMINS","CUMMINS","Motor eléctrico Co., Ltd. de Shanghai Nanyang","\tMotor eléctrico especial Co., Ltd. de Jiangxi","batería LMP® “totalmente sólida","ELECTRICO ANSALDO    ELECTRIC    DRIVES","BYD  ","BYD   ","Harbin Guangyu Power","Siemens ","Weichai Westport New Energy Power Co., Ltd.","BMW","YUCHAI YC4EG160-50,YC4EG160N-50","\tPMSM","PMSM","PMSM","FIAT DUCATO","Mellor Orion E","NAVYA ELECTRIC","Enova Systems P120 AC","Magtec","Mono sincrono ","Asynchronous, six-terminal","Asynchronous, six-terminal","Sin Información","TATA","Irizar Group","Puma TDCi 2.2l 14","BALLARD","Siemens","YUTONG  ","BYD  ",null,"VOLKSWAGEN 11.180 OD"]
["MODELO","FPT NEF6 GNC 5.9","NEF 6 GNC","D0834","SCANIA 280","DC 4D34I","OM 924 LA","J05E"," 4HK1-TCN","4HK1-TCN","ISF 160","ISF 160","ISDe 210 41","B 67 GES 230","ISF 3.8","ISF 3.8","ISD 4.5","ISD 4.5","ISD "," HFF6700BEV","\tTZ400XS200","LMP","IGBT ","BYD-TYC90A ","TYC-180A","YKHTTM005\t","1DB2016","WP5NG180E50","Battery Electric Vehicle (BEV)","\tXMQ6802G","XMQ6706GEV","XMQ6706 EV","XMQ6662GEV","FIAT  ","solo energía eléctrica (EV)","LiFeP04 battery pack","OPTARE  ","P144","asynchronous","wattercooling","wattercooling","Vero 9","PAMC","Sincrono","E-Transit","SIEMENS","1DB2016","Zhengzhou","B93S01",null,"SCANIA F280 4x2"]
["COMBUSTIBLE","GAS",0,"DIÉSEL","GAS","DIÉSEL","DIÉSEL","DIÉSEL","DIÉSEL","DIÉSEL","DIÉSEL","DIÉSEL","DIÉSEL","GAS","DIÉSEL","DIESEL","DIÉSEL","DIÉSEL","GAS NATURAL","solo energía eléctrica (BEV)","solo energía eléctrica (BEV)","solo energía eléctrica (BEV)","solo energía eléctrica (BEV)","solo energía eléctrica (BEV)","solo energía eléctrica (BEV)","solo energía eléctrica (BEV)","solo energía eléctrica (BEV)","solo energía eléctrica (BEV)","solo energía eléctrica (BEV)","Híbrido diesel-eléctrico /Híbrido gas-eléctrico","solo energía eléctrica (BEV)","solo energía eléctrica (BEV)","solo energía eléctrica (BEV)","DIESEL","solo energía eléctrica (EV)","solo energía eléctrica (EV)","solo energía eléctrica (BEV)","solo energía eléctrica (BEV)","solo energía eléctrica (BEV)","solo energía eléctrica (BEV)","solo energía eléctrica (BEV)","solo energía eléctrica (BEV)","solo energía eléctrica (BEV)","solo energía eléctrica (BEV)","Diesel","solo energía eléctrica (BEV)","solo energía eléctrica (BEV)","solo energía eléctrica (BEV)","solo energía eléctrica (BEV)",null,"MERCEDES BENZ OF 917"]
["CILINDROS",6,6,4,5,4,4,4,4,4,4,4,6,6,4,4,4,4,4,"N/A","N/A","N/A","N/A","N/A","N/A","N/A","N/A","N/A","N/A","N/A","N/A","N/A","N/A",4,"N/A","N/A","N/A","N/A","N/A","N/A","N/A","N/A","N/A","N/A",4,"N/A","N/A","N/A","N/A",null,"MERCEDES BENZ LO 916"]
["CILINDRADA","5.9","5.9","4.6","9.3","3.9","4.8","5.1","5.2","5.2","3.8","3.8","6.7","5.9","3.8","3.8","4.5","4.5",5.2,"N/A","N/A","N/A","N/A","N/A","N/A","N/A","N/A","N/A","N/A","N/A","N/A","N/A","N/A","N/A","N/A","N/A","N/A","N/A","N/A","N/A","N/A","N/A","N/A","N/A   ",2200,"N/A","N/A","N/A","N/A",null,"HINO FC9J "]
["POTENCIA CV","204 CV ","200 CV ","174 CV","280 CV","172 CV","156 CV","180 CV","155 CV","155 CV","162 CV","162 CV","233 CV","233 CV","162 CV","162 CV","182 CV","203 CV ","180 CV","136 CV","\t123 CV","102CV","100CV","180 Kw -241 hp","100CV","102CV","125/160 CV","179 CV","135 & 184 CV","P","115/150 CV","115/150 CV","P","158Kw","289kW","3HV","115 -130 Kw","150HV","160 Kw","120 Kw","120 Kw","POR CONFIRMAR ","145KW","180 Kw","155HP @ 3.500 rpm","162 kw","160 Kw","120/240 Kw","180kw",null,"CHEVROLET NQR "]
["TORQUE MAX","750 Nm a 1100 a 1600 rpm","650 Nm 1100 a 1250 rpm","600 Nm a 1000 a 1850 rpm","1.350 Nm entre 1,000 -1,400 rpm","520 N.m (53 KGF-M) A 1.500 rpm","580 N.m (59 KGF-M) DE 1.200 A 1.600 rpm","539 Nm a 1500 rpm","419 Nm a 1600 rpm","419 Nm a 1600 rpm","600 Nm a 1700 rpm","600 Nm a 1700 rpm","830 Nm a 2300 rpm","500Nm a 1600 rpm ","6OO Nm a 1700 RPM","6OO Nm a 1700 RPM","600 Nm a 1000 a 1850 rpm","600 Nm a 1000 a 1850 rpm","650 Nm/ 1.300 a 1.700","100 kW","90 KW","90KW","260 Nm a 2.200 RPM","800 Nm a 2000RPM","1500Nm a 2000RPM","\t75KW","1019Nm a 2500 RPM","132 Kw","290KW","P","P","P","P","130Nm a 3500","EURO VI","15KW","2381 Nm a 2650 rpm","2381 Nm a 2650 rpm","1.500 Nm ","968 Nm","968 Nm","POR CONFIRMAR ","1019Nm a 2500 RPM","1.500 Nm","285 lb-ft @ 1.500 rpm","POR CONFIRMAR","973 Nm a 1.500rpm","1400NM a 2.500rpm","1500Nm a 5000rom",null,"CHEVROLET NPR "]
["NORMA DE EMISIONES","EURO VI","EURO VI","EURO VI SCR","EURO VI","EURO V SCR","EURO V SCR","EURO V SCR","EURO V (EGR / CATALIZADOR  DOC)","EURO V (EGR / CATALIZADOR  DOC)","EURO V SCR","EURO V SCR","EURO V SCR","EURO V ","EURO V SCR","EURO V SCR","EURO V SCR","EURO V SCR","EURO V","solo energía eléctrica (EV)","solo energía eléctrica (EV)","solo energía eléctrica (EV)","solo energía eléctrica (EV)","solo energía eléctrica (EV)","solo energía eléctrica (EV)","solo energía eléctrica (EV)","solo energía eléctrica (EV)","solo energía eléctrica (EV)","solo energía eléctrica (EV)","Hibrido (HEV)","solo energía eléctrica (EV)","solo energía eléctrica (EV)","solo energía eléctrica (EV)","solo energía eléctrica (EV)","solo energía eléctrica (EV)","solo energía eléctrica (EV)","solo energía eléctrica (EV)","solo energía eléctrica (EV)","solo energía eléctrica (EV)","solo energía eléctrica (EV)","solo energía eléctrica (EV)","solo energía eléctrica (EV)","solo energía eléctrica (EV)","solo energía eléctrica (EV)","Euro V","solo energía eléctrica (EV)","solo energía eléctrica (EV)","solo energía eléctrica (EV)","solo energía eléctrica (EV)",null,"VOLKSWAGEN 9.160 OD"]
["TRANSMISIÓN","ALLISON T3325R ","ZF S5-420 HD ","EATON ESBO 6206A","ALLISON T3000","M.B. DC M036 - S6","ZF S5-580 BO","LX06S","ISUZU/MYY6S","ISUZU/MYY6S","ZF S5-420 HD","ZF S5-420 HD","POR CONFIRMAR","POR CONFIRMAR","EATON FSO 4505C","EATON FSO 4505C","ZF S5-420 HD","ZF S5-420 HD "," WLY6G120 ","Shanghai Nanyang","ANYUAN  ","BLUEBUS","BMS","BYD","BYD","DONGFENG   ","EVOPRO   ","FOTON ","BMW","P","P","P","P","FIAT","AUTOMATICO","N/A","OPTARE  ","OPTARE  ","SOLARIS  ","SOR ","SOR ","TAM   ","TATA MOTORS  ","Irizar Group","FORD Gearbox XS4R7F096","KIEPE"," VDL Bus & Coach","YUTONG","BYD",null,"VOLKSWAGEN 8.160 OD"]
["TIPO TRANSMISIÓN","AUTOMÁTICA","MANUAL","MANUAL","AUTOMÁTICA","MANUAL","MANUAL","MANUAL","MANUAL","MANUAL","MANUAL","MANUAL","MANUAL","MANUAL","MANUAL","MANUAL","MANUAL","MANUAL","MANUAL","AUTOMÁTICA","AUTOMATICA","AUTOMATICA","AUTOMATICA","AUTOMATICA","AUTOMATICA","AUTOMATICA","AUTOMATICA","AUTOMATICA","AUTOMATICA","AUTOMATICA","AUTOMATICA","AUTOMATICA","AUTOMATICA","MANUAL",1,"AUTOMATICO","AUTOMATICO","AUTOMATICO","AUTOMATICO","AUTOMATICO","AUTOMATICO","AUTOMATICO","AUTOMATICO","AUTOMATICO","Manual ","AUTOMATICO","AUTOMATICO","AUTOMATICO","AUTOMATICO",null,"SUNWIN SWB6890M64"]
["MARCHAS ADELANTE ",6,6,6,5,6,5,6,6,6,5,5,5,5,5,5,5,6,6,1,1,1,1,1,1,1,1,1,1,1,1,1,1,"7 Speed DSG Auto","7 Speed DSG Auto ",1,1,1,1,1,1,1,1,1,6,1,1,1,1,null,"SUNWIN SWB6850Q"]
["RETARDADOR","SI","SI","N/A","SI","N/A","N/A","N/A","N/A","N/A","N/A","N/A","N/A","N/A","N/A","N/A","N/A","N/A","N/A","Electromagnetico","Electromagnetico","Electromagnetico","Electromagnetico","Electromagnetico","Electromagnetico","Electromagnetico","Electromagnetico","Electromagnetico","Electromagnetico","Electromagnetico","Electromagnetico","Electromagnetico","Electromagnetico","Electromagnetico","Electromagnetico","Electromagnetico","Electromagnetico","Electromagnetico","Electromagnetico","Electromagnetico","Electromagnetico","Electromagnetico","Electromagnetico","Electromagnetico","N/A","Electromagnetico","Electromagnetico","Electromagnetico","Electromagnetico",null,"AGRALE MA 9.6"]
["TENSIÓN ","24V","24V","24V","24V","24V","24V","24V","24V","24V","24V","24V","24V","24V","24V","24V","24V","24V","24V","Alta tensión","24V","Alta tensión","Alta tensión","Alta tensión","Alta tensión","Alta tensión","Alta tensión","Alta tensión","Alta tensión","Alta tensión","Alta tensión","Alta tensión","Alta tensión","Alta tensión","Alta tensión","Alta tensión","Alta tensión","Alta tensión","Alta tensión","Alta tensión","Alta tensión","Alta tensión","Alta tensión","Alta tensión","Alta tensión","Alta tensión","Alta tensión","Alta tensión","Alta tensión",null,"DAEWOO A85"]
{"$rows_left_out":31}
{"sheet":"ANEXO 2 -->","index":5,"n_rows":4,"n_cols":2,"rows_kept":4,"cut":false,"hidden":false,"merged":[]}
[]
[null,"Anexo 2 - Aspectos relativos a la infraestructura para la puesta en operación de una flota de autobuses"]
[]
[null,"La puesta en operación de una flota de autobuses además de una adecuada selección requiere de afrontar muchos retos, \nentre los cuales se encuentra el diseño o ajuste de una infraestructura para el alojamiento de una nueva tecnología. En este anexo se indican algunos parámetros a tener en cuenta para la puesta en operación de una flota de\nautobuses, en lo tocante a temas de:\n\n• Infraestructura.\n• Lugares de estacionamiento.\n• Abastecimiento de energéticos.\n• Planta de personal sugerida de acuerdo a la recolección de lecciones aprendidas.\n• Zona destinada para mantenimiento (preventivo, correctivo y predictivo).\n• Zona de lavado de flota y Planta PETARI.\n• Baterías de sanitarias (Personal técnico y administrativo).\n• Línea de vida (para trabajo en alturas)."]

{"sheet":"Instrucciones de Uso A2","index":6,"n_rows":2,"n_cols":2,"rows_kept":2,"cut":false,"hidden":false,"merged":[[1,1,37,14]]}
[]
[null,"En la presente hoja de calculo usted podrá encontrar dos pestañas denominadas \"Infraestructura\", \"Areas\" y \"Estacionamiento de flota\" en cada una de ellas encontrará:                              \n  \n- En la pestaña \"Infraestructura\" se indican algunos parámetros a tener en cuenta para la puesta en operación de una flota de autobuses. \n\n- En la pestaña \"Areas\" puede apreciar información referente a la cantidad sugerida de personal para una operación de máximo 200 autobuses, asi mismo, podrá evidenciar información referente a los espacios mínimos requeridos por la normatividad nacional en cuanto a unidades sanitarias y unidades de vestuario.\n\n- En la pestaña \"Estacionamiento de flota\" podrá encontrar dimensiones sugeridas para los estacionamientos de los autobuses, de acuerdo con el tamaño de la misma y las posibilidades de acomodación.\n\nPor favor modificar unicamente las celdas identificadas con el color \"Azul\"              \n\n\n"]

{"sheet":"Infraestructura","index":7,"n_rows":222,"n_cols":1,"rows_kept":222,"cut":false,"hidden":false,"merged":[]}
["Análisis de la infraestructura física y energética para la puesta en operación para las distintas opciones de tecnología para la flota."]
[]
["En este apartado, se indican algunos parámetros a tener en cuenta para la puesta en operación de una flota de autobuses, en lo tocante a temas de infraestructura y energéticos requeridos. Como se desconoce la cantidad de flota agrupada por zona, se plantea un modelo que enmarque grupos de flota de la siguiente forma:"]
[]
["·         Grupo 1: 1-100 autobuses."]
["·         Grupo 2. 101-200 autobuses."]
["Infraestructura: En lo relacionado con este punto, se deben tener en cuenta los siguientes aspectos:"]
[]
["·         Lugares de estacionamiento y zonas de libre tránsito de la flota, para desplazamientos internos."]
["·         Punto de aprovisionamiento de combustible."]
["·         Zona destinada para mantenimiento (preventivo, correctivo y predictivo)."]
["·         Zona de lavado de flota y Planta PETARI"]
["·         Baterías de sanitarias (Personal técnico y administrativo)."]
["·         Línea de vida   "]
[]
{"$rows_left_out":208}
{"sheet":"Areas","index":8,"n_rows":51,"n_cols":7,"rows_kept":51,"cut":false,"hidden":false,"merged":[[46,5,48,5],[46,6,48,6],[50,2,52,6],[1,1,2,5],[5,1,39,1],[7,2,11,2],[12,2,16,2],[17,2,18,2],[19,2,23,2],[24,2,28,2],[29,2,31,2],[32,2,38,2],[39,2,39,3]]}
[]
[null,"En el presente ejercicio, se expone una planta de personal sugerida de acuerdo a la experiencia recopilada y así mismo lo requerido frente al equipo sanitario capacidad 50 a 200 autobuses"]
[]
[]
[null,"NÚMERO DE BUSES","ÁREA","CARGO","CANTIDAD DE PERSONAS"," ÍNDICE DE PERSONAS POR BUS"]
[null,120,"OPERATIVO","OPERADORES",{"$f":"(B6*2.5)","v":300},2.5]
[null,null,"GERENCIA","GERENTE GENERAL",1,1]
[null,null,"FINANCIERA","GERENTE FINANCIERO",1,1]
[null,null,null,"JEFE DE CONTABILIDAD",1,1]
[null,null,null,"ANALISTA CONTABLE ",1,1]
[null,null,null,"AUXILIAR CONTABLE",2,2]
[null,null,null,"TESORERO",1,1]
[null,null,"ABASTECIMIENTO","JEFE DE COMPRAS",1,1]
[null,null,null,"ANALISTA DE COMPRAS",2,1.6666666666666666E-2]
[null,null,null,"AUXILIAR DE BODEGA",2,1.6666666666666666E-2]
{"$rows_left_out":37}
{"sheet":"Estacionamiento de la flota","index":9,"n_rows":29,"n_cols":9,"rows_kept":29,"cut":false,"hidden":false,"merged":[[0,8,18,12],[20,5,21,7],[28,1,28,5]]}
[null,null,null,null,null,null,null,null,"Teniendo en cuenta que los autobuses objeto de estudio hacen referencia a tipología de 50 o menos pasajeros y de acuerdo con la información recopilada frente a las dimensiones de estos, en su mayoría se ubican sobre los 9.000 mm de longitud, la \"Resolución 2306 del 13 de junio de 2008\" expresa que el ancho máximo permitido para estos vehículos es de 2.600 mm, de acuerdo a las características de homologación. "]
[]
[]
[]
[]
[]
[]
[]
[]
[]
[]
[]
[]
[]
[]
{"$rows_left_out":14}